Reaction Details
TargetFibroblast growth factor receptor 1
LigandBDBM287005
Substrate/Competitorn/a
Meas. Tech.Caliper-Based Kinase Assay
Temperature298.15±n/a K
IC50 0.600±n/a nM
Commentsextracted
Citation Verner, EBrameld, KA Quinolone derivatives as fibroblast growth factor receptor inhibitors US Patent US9567334 Publication Date 2/14/2017
 
Fibroblast growth factor receptor 1
Name:Fibroblast growth factor receptor 1
Type:Receptor
Mol. Mass.:91861.70
Organism:Homo sapiens (Human)
Description:P11362
Residue:822
BDBM287005
NameBDBM287005
Synonyms:8-(3-(4-acryloylpiperazin-1-yl)propyl)-6-(2,6-dichloro-3,5-dimethoxyphenyl)-2-((2-hydroxyethyl)amino)pyrido[2,3-d]pyrimidin-7(8H)-one US11078199, Cpd 13 US9815834, Compound 13
TypeSmall organic molecule
Emp. Form.C27H32Cl2N6O5
Mol. Mass.591.486
SMILESCOc1cc(OC)c(Cl)c(c1Cl)-c1cc2cnc(NCCO)nc2n(CCCN2CCN(CC2)C(=O)C=C)c1=O