Reaction Details
TargetFibroblast growth factor receptor 1
LigandBDBM287015
Substrate/Competitorn/a
Meas. Tech.Caliper-Based Kinase Assay
Temperature298.15±n/a K
IC50 0.700±n/a nM
Commentsextracted
Citation Verner, EBrameld, KA Quinolone derivatives as fibroblast growth factor receptor inhibitors US Patent US9567334 Publication Date 2/14/2017
 
Fibroblast growth factor receptor 1
Name:Fibroblast growth factor receptor 1
Type:Receptor
Mol. Mass.:91861.70
Organism:Homo sapiens (Human)
Description:P11362
Residue:822
BDBM287015
NameBDBM287015
Synonyms:(R)-8-(3-(4-acryloylpiperazin-1-yl)propyl)-6-(2,6-dichloro-3,5-dimethoxyphenyl)-2-((tetrahydrofuran-3-yl)amino)pyrido[2,3-d]pyrimidin-7(8H)-one US11078199, Cpd 56 US9815834, Compound 56
TypeSmall organic molecule
Emp. Form.C29H34Cl2N6O5
Mol. Mass.617.523
SMILESCOc1cc(OC)c(Cl)c(c1Cl)-c1cc2cnc(N[C@@H]3CCOC3)nc2n(CCCN2CCN(CC2)C(=O)C=C)c1=O