Reaction Details
TargetFocal adhesion kinase 1
LigandBDBM155537
Substrate/Competitorn/a
Meas. Tech.Biochemical Alpha Screen Assay
pH7.4±n/a
IC50 0.6±n/a nM
Commentsextracted
Citation Holmes, IPBergman, YLunniss, GENikac, MChoi, NHemley, CFWalker, SRFoitzik, RCGaname, DLessene, R FAK inhibitors US Patent US9012461 Publication Date 4/21/2015
 
Focal adhesion kinase 1
Name:Focal adhesion kinase 1
Type:Tyrosine-protein kinase
Mol. Mass.:119233.17
Organism:Homo sapiens (Human)
Description:Q05397
Residue:1052
BDBM155537
NameBDBM155537
Synonyms:US9012461, 13
TypeSmall organic molecule
Emp. Form.C27H29F3N6O2
Mol. Mass.526.5534
SMILESCC(=O)N1CCN(CC1)c1ccc(Nc2ncc(c(CCc3ccccc3CC(N)=O)n2)C(F)(F)F)cc1