Reaction Details
TargetFocal adhesion kinase 1
LigandBDBM155552
Substrate/Competitorn/a
Meas. Tech.Biochemical Alpha Screen Assay
pH7.4±n/a
IC50 0.3±n/a nM
Commentsextracted
Citation Holmes, IPBergman, YLunniss, GENikac, MChoi, NHemley, CFWalker, SRFoitzik, RCGaname, DLessene, R FAK inhibitors US Patent US9012461 Publication Date 4/21/2015
 
Focal adhesion kinase 1
Name:Focal adhesion kinase 1
Type:Tyrosine-protein kinase
Mol. Mass.:119233.17
Organism:Homo sapiens (Human)
Description:Q05397
Residue:1052
BDBM155552
NameBDBM155552
Synonyms:US9012461, 28
TypeSmall organic molecule
Emp. Form.C25H26F3N5O
Mol. Mass.469.502
SMILESCN1CCc2cc(Nc3ncc(c(CCc4ccccc4CC(N)=O)n3)C(F)(F)F)ccc2C1