Reaction Details
TargetAurora kinase A
LigandBDBM155568
Substrate/Competitorn/a
Meas. Tech.Inhibitory Assay
pH7.4±n/a
Temperature298.15±n/a K
IC50 0.4±n/a nM
Commentsextracted
Citation Hirai, HSootome, H Method for enhancing anti-tumor effect of a microtubule-targeting drug, and a method for treatment of tumor US Patent US9012475 Publication Date 4/21/2015
 
Aurora kinase A
Name:Aurora kinase A
Type:Serine/threonine-protein kinase
Mol. Mass.:45830.98
Organism:Homo sapiens (Human)
Description:O14965
Residue:403
BDBM155568
NameBDBM155568
Synonyms:US10092556, Example 12 US9346787, 12
TypeSmall organic molecule
Emp. Form.C23H22Cl2FN5O3
Mol. Mass.506.357
SMILESCc1cc(Nc2nc(CC3(CCN(CC3)C(=O)c3cccc(Cl)c3F)C(O)=O)ccc2Cl)n[nH]1