Reaction Details
TargetAurora kinase A
LigandBDBM155570
Substrate/Competitorn/a
Meas. Tech.Inhibitory Assay
pH7.4±n/a
Temperature298.15±n/a K
IC50 0.9±n/a nM
Commentsextracted
Citation Hirai, HSootome, H Method for enhancing anti-tumor effect of a microtubule-targeting drug, and a method for treatment of tumor US Patent US9012475 Publication Date 4/21/2015
 
Aurora kinase A
Name:Aurora kinase A
Type:Serine/threonine-protein kinase
Mol. Mass.:45830.98
Organism:Homo sapiens (Human)
Description:O14965
Residue:403
BDBM155570
NameBDBM155570
Synonyms:US10092556, Example 14 US9346787, 14
TypeSmall organic molecule
Emp. Form.C24H25ClF2N6O2
Mol. Mass.502.944
SMILESCNC(=O)C1(Cc2ccc(F)c(Nc3cc(C)[nH]n3)n2)CCN(CC1)C(=O)c1cccc(Cl)c1F