Reaction Details
TargetD(3) dopamine receptor
LigandBDBM155943
Substrate/Competitorn/a
Meas. Tech.Receptor Assay
pH7.4±n/a
IC50 15.1±n/a nM
Commentsextracted
Citation Zhang, GChen, YXu, XLiu, XZhao, SLiu, BYu, MQiu, Y Alicyclic[c] benzopyrone derivatives and uses thereof US Patent US9018213 Publication Date 4/28/2015
 
D(3) dopamine receptor
Name:D(3) dopamine receptor
Type:Protein
Mol. Mass.:49540.58
Organism:Rattus norvegicus (Rat)
Description:P19020
Residue:446
BDBM155943
NameBDBM155943
Synonyms:US9018213, 14
TypeSmall organic molecule
Emp. Form.C27H28ClN3O3S
Mol. Mass.510.048
SMILESClc1c(OCCCCN2CCN(CC2)c2nsc3ccccc23)ccc2c3CCCc3c(=O)oc12