Reaction Details
Target5-hydroxytryptamine receptor 2C
LigandBDBM155937
Substrate/Competitorn/a
Meas. Tech.Receptor Binding Assay
IC50 1300.6±n/a nM
Citation Zhang, GChen, YXu, XLiu, XZhao, SLiu, BYu, MQiu, Y Alicyclic[c] benzopyrone derivatives and uses thereof US Patent US9018213 Publication Date 4/28/2015
 
5-hydroxytryptamine receptor 2C
Name:5-hydroxytryptamine receptor 2C
Type:Enzyme
Mol. Mass.:51935.10
Organism:Rattus norvegicus (Rat)
Description:P08909
Residue:460
BDBM155937
NameBDBM155937
Synonyms:US9018213, 7
TypeSmall organic molecule
Emp. Form.C27H32N2O4
Mol. Mass.448.554
SMILESOCc1ccccc1N1CCN(CCCCOc2ccc3c4CCCc4c(=O)oc3c2)CC1