Reaction Details
Target5-hydroxytryptamine receptor 2C
LigandBDBM155943
Substrate/Competitorn/a
Meas. Tech.Receptor Binding Assay
IC50 1489.2±n/a nM
Citation Zhang, GChen, YXu, XLiu, XZhao, SLiu, BYu, MQiu, Y Alicyclic[c] benzopyrone derivatives and uses thereof US Patent US9018213 Publication Date 4/28/2015
 
5-hydroxytryptamine receptor 2C
Name:5-hydroxytryptamine receptor 2C
Type:Enzyme
Mol. Mass.:51935.10
Organism:Rattus norvegicus (Rat)
Description:P08909
Residue:460
BDBM155943
NameBDBM155943
Synonyms:US9018213, 14
TypeSmall organic molecule
Emp. Form.C27H28ClN3O3S
Mol. Mass.510.048
SMILESClc1c(OCCCCN2CCN(CC2)c2nsc3ccccc23)ccc2c3CCCc3c(=O)oc12