Reaction Details
Target5-hydroxytryptamine receptor 2C
LigandBDBM50448210
Substrate/Competitorn/a
Meas. Tech.Receptor Binding Assay
IC50 1893.6±n/a nM
Citation Zhang, GChen, YXu, XLiu, XZhao, SLiu, BYu, MQiu, Y Alicyclic[c] benzopyrone derivatives and uses thereof US Patent US9018213 Publication Date 4/28/2015
 
5-hydroxytryptamine receptor 2C
Name:5-hydroxytryptamine receptor 2C
Type:Enzyme
Mol. Mass.:51935.10
Organism:Rattus norvegicus (Rat)
Description:P08909
Residue:460
BDBM50448210
NameBDBM50448210
Synonyms:CHEMBL3120697 | US9018213, 15
TypeSmall organic molecule
Emp. Form.C28H28ClFN2O4
Mol. Mass.510.984
SMILESFc1ccc2c(noc2c1)C1CCN(CCCCOc2ccc3c4CCCc4c(=O)oc3c2Cl)CC1