Reaction Details
Target5-hydroxytryptamine receptor 2C
LigandBDBM155947
Substrate/Competitorn/a
Meas. Tech.Receptor Binding Assay
IC50 1123.3±n/a nM
Citation Zhang, GChen, YXu, XLiu, XZhao, SLiu, BYu, MQiu, Y Alicyclic[c] benzopyrone derivatives and uses thereof US Patent US9018213 Publication Date 4/28/2015
 
5-hydroxytryptamine receptor 2C
Name:5-hydroxytryptamine receptor 2C
Type:Enzyme
Mol. Mass.:51935.10
Organism:Rattus norvegicus (Rat)
Description:P08909
Residue:460
BDBM155947
NameBDBM155947
Synonyms:US9018213, 19
TypeSmall organic molecule
Emp. Form.C28H34N2O4
Mol. Mass.462.5806
SMILESOCc1ccccc1N1CCN(CCCCOc2ccc3c4CCCCc4c(=O)oc3c2)CC1