Reaction Details
TargetApoptosis regulator Bcl-2
LigandBDBM156397
Substrate/Competitorn/a
Meas. Tech.Fluorescence Polarization
IC50 0.3±n/a nM
Citation Diebold, RBGero, TGrover, PHuang, SIoannidis, SOgoe, CASaeh, JC Chemical compounds US Patent US9018381 Publication Date 4/28/2015
 
Apoptosis regulator Bcl-2
Name:Apoptosis regulator Bcl-2
Type:Homodimer or heterodimer
Mol. Mass.:26269.11
Organism:Homo sapiens (Human)
Description:P10415
Residue:239
BDBM156397
NameBDBM156397
Synonyms:US9018381, 20
TypeSmall organic molecule
Emp. Form.C51H59ClF3N5O7S3
Mol. Mass.1042.687
SMILESCCN(CC)C[C@H]1COCCN1CC[C@H](CSc1ccccc1)Nc1ccc(cc1S(=O)(=O)C(F)(F)F)S(=O)(=O)NC(=O)c1ccc(cc1)N1CCC(CC1)[C@@H](O)c1ccccc1-c1ccc(Cl)cc1