Reaction Details
TargetHistamine H3 receptor
LigandBDBM159245
Substrate/Competitorn/a
Meas. Tech.LANCE Ultra cAMP Assay
Ki 2.4±n/a nM
Citation Auberson, YBock, MGBraga, DCurzi, MDodd, SKGiaffreda, SLJiang, HKarpinski, PTroxler, TJWang, TWang, XZhang, X Carbamate/urea derivatives US Patent US9034874 Publication Date 5/19/2015
 
Histamine H3 receptor
Name:Histamine H3 receptor
Type:G Protein-Coupled Receptor (GPCR)
Mol. Mass.:48691.47
Organism:Homo sapiens (Human)
Description:Binding assays were using CHO cells stably expressing hH3R receptors.
Residue:445
BDBM159245
NameBDBM159245
Synonyms:US9034874, 1.2
TypeSmall organic molecule
Emp. Form.C18H29N5O3
Mol. Mass.363.4546
SMILESCC(C)N1CCN(CC1)C(=O)OC1CCN(CC1)c1ccc(=O)n(C)n1