Reaction Details
TargetHistamine H3 receptor
LigandBDBM159246
Substrate/Competitorn/a
Meas. Tech.LANCE Ultra cAMP Assay
Ki 1.2±n/a nM
Citation Auberson, YBock, MGBraga, DCurzi, MDodd, SKGiaffreda, SLJiang, HKarpinski, PTroxler, TJWang, TWang, XZhang, X Carbamate/urea derivatives US Patent US9034874 Publication Date 5/19/2015
 
Histamine H3 receptor
Name:Histamine H3 receptor
Type:G Protein-Coupled Receptor (GPCR)
Mol. Mass.:48691.47
Organism:Homo sapiens (Human)
Description:Binding assays were using CHO cells stably expressing hH3R receptors.
Residue:445
BDBM159246
NameBDBM159246
Synonyms:US9034874, 1.3
TypeSmall organic molecule
Emp. Form.C17H27N5O3
Mol. Mass.349.428
SMILESCC(C)N1CCN(CC1)C(=O)OC1CCN(CC1)c1ccc(=O)[nH]n1