Reaction Details
TargetSodium/glucose cotransporter 2
LigandBDBM159471
Substrate/Competitorn/a
Meas. Tech.Inhibition Assay
pH7.4±n/a
Temperature310.15±n/a K
IC50 0.551±n/a nM
Commentsextracted
Citation Choi, SSong, KSLee, SHKim, MJSeo, HJPark, EKong, YPark, SOKang, HJung, MELee, KKim, HJLee, JSLee, MWKim, MHong, DHKang, M Diphenylmethane derivatives as SGLT2 inhibitors US Patent US9034921 Publication Date 5/19/2015
 
Sodium/glucose cotransporter 2
Name:Sodium/glucose cotransporter 2
Type:Protein
Mol. Mass.:72902.00
Organism:Homo sapiens (Human)
Description:P31639
Residue:672
BDBM159471
NameBDBM159471
Synonyms:US9034921, E113
TypeSmall organic molecule
Emp. Form.C22H25ClO7S
Mol. Mass.468.948
SMILESCOc1cc(cc(Cc2ccc3OCCOc3c2)c1Cl)[C@@H]1O[C@H](SC)[C@@H](O)[C@H](O)[C@H]1O