Reaction Details
TargetSodium/glucose cotransporter 2
LigandBDBM159474
Substrate/Competitorn/a
Meas. Tech.Inhibition Assay
pH7.4±n/a
Temperature310.15±n/a K
IC50 0.475±n/a nM
Commentsextracted
Citation Choi, SSong, KSLee, SHKim, MJSeo, HJPark, EKong, YPark, SOKang, HJung, MELee, KKim, HJLee, JSLee, MWKim, MHong, DHKang, M Diphenylmethane derivatives as SGLT2 inhibitors US Patent US9034921 Publication Date 5/19/2015
 
Sodium/glucose cotransporter 2
Name:Sodium/glucose cotransporter 2
Type:Protein
Mol. Mass.:72902.00
Organism:Homo sapiens (Human)
Description:P31639
Residue:672
BDBM159474
NameBDBM159474
Synonyms:US9034921, E116
TypeSmall organic molecule
Emp. Form.C24H30ClNO5
Mol. Mass.447.952
SMILESCN(C)c1ccc(Cc2cc([C@@H]3O[C@H](CO)[C@@H](O)[C@H](O)[C@H]3O)c3CCCc3c2Cl)cc1