Reaction Details
TargetP2X purinoceptor 7
LigandBDBM160135
Substrate/Competitorn/a
Meas. Tech.Radioligand Binding Assay
Ki 1.6±n/a nM
Citation Ameriks, MKRech, JCSavall, BM [1,2,4]triazolo[4,3-a]pyrazines as P2X7 modulators US Patent US9040534 Publication Date 5/26/2015
 
P2X purinoceptor 7
Name:P2X purinoceptor 7
Type:Protein
Mol. Mass.:68403.50
Organism:Rattus norvegicus (Rat)
Description:Q64663
Residue:595
BDBM160135
NameBDBM160135
Synonyms:US10047092, 76 US9040534, 76
TypeSmall organic molecule
Emp. Form.C20H16ClF4N5O
Mol. Mass.453.821
SMILESCC[C@H]1Cn2c(nnc2-c2ccc(F)cn2)C(=O)N1Cc1cccc(c1Cl)C(F)(F)F