Reaction Details
TargetP2X purinoceptor 7
LigandBDBM48901
Substrate/Competitorn/a
Meas. Tech.FLIPR Assay
pH7.4±n/a
IC50 36.1±n/a nM
Commentsextracted
Citation Ameriks, MKRech, JCSavall, BM [1,2,4]triazolo[4,3-a]pyrazines as P2X7 modulators US Patent US9040534 Publication Date 5/26/2015
 
P2X purinoceptor 7
Name:P2X purinoceptor 7
Type:Protein
Mol. Mass.:68403.50
Organism:Rattus norvegicus (Rat)
Description:Q64663
Residue:595
BDBM48901
NameBDBM48901
Synonyms:BDBM160086 US10053463, 27 | US9040534, 72
Typen/a
Emp. Form.C18H14ClF3N6O
Mol. Mass.422.792
SMILESC[C@H]1Cn2c(nnc2-c2ncccn2)C(=O)N1Cc1cccc(c1Cl)C(F)(F)F