Reaction Details
TargetMelanocortin receptor 4
LigandBDBM160158
Substrate/Competitorn/a
Meas. Tech.Competitive Inhibition Assay
pH7.5±n/a
Temperature310.15±n/a K
Ki 0.055±n/a nM
Commentsextracted
Citation Dodd, JHShi, YYang, W Melanocortin receptor-specific peptides US Patent US9040663 Publication Date 5/26/2015
 
Melanocortin receptor 4
Name:Melanocortin receptor 4
Type:Enzyme
Mol. Mass.:36949.50
Organism:Homo sapiens (Human)
Description:P32245
Residue:332
BDBM160158
NameBDBM160158
Synonyms:US9040663, 4
TypeSmall organic molecule
Emp. Form.C48H69Cl2N17O9
Mol. Mass.1099.076
SMILESCC(=O)N[C@@H](CCCNC(N)=N)C(=O)N[C@H]1CCC(=O)NCCC[C@H](NC(=O)[C@H](Cc2c[nH]c3ccccc23)NC(=O)[C@H](CCCNC(N)=N)NC(=O)[C@@H](Cc2ccc(Cl)cc2Cl)NC(=O)[C@H](CCN)NC1=O)C(N)=O