Reaction Details
TargetD(1A) dopamine receptor
LigandBDBM160924
Substrate/Competitorn/a
Meas. Tech.Competition Binding Assay
Ki 6.91±n/a nM
Citation Brodney, MADavoren, JEDounay, ABEfremov, IVGray, DLGreen, MEHenderson, JLLee, CMente, SRO'Neil, SVRogers, BNZhang, L Heteroaromatic compounds and their use as dopamine D1 ligands US Patent US9107923 Publication Date 8/18/2015
 
D(1A) dopamine receptor
Name:D(1A) dopamine receptor
Type:Enzyme
Mol. Mass.:49303.43
Organism:Homo sapiens (Human)
Description:P21728
Residue:446
BDBM160924
NameBDBM160924
Synonyms:US9107923, 13
TypeSmall organic molecule
Emp. Form.C19H17F2N3O4
Mol. Mass.389.3528
SMILESCc1cc(Oc2ncccc2OC(F)F)ccc1-c1c(C)c(=O)[nH]c(=O)n1C