Reaction Details
TargetD(1A) dopamine receptor
LigandBDBM160878
Substrate/Competitorn/a
Meas. Tech.Competition Binding Assay
Ki 0.571±n/a nM
Citation Brodney, MADavoren, JEDounay, ABEfremov, IVGray, DLGreen, MEHenderson, JLLee, CMente, SRO'Neil, SVRogers, BNZhang, L Heteroaromatic compounds and their use as dopamine D1 ligands US Patent US9107923 Publication Date 8/18/2015
 
D(1A) dopamine receptor
Name:D(1A) dopamine receptor
Type:Enzyme
Mol. Mass.:49303.43
Organism:Homo sapiens (Human)
Description:P21728
Residue:446
BDBM160878
NameBDBM160878
Synonyms:US10093655, Example 48 US9107923, 48
TypeSmall organic molecule
Emp. Form.C18H16IN3O2
Mol. Mass.433.243
SMILESCc1cc(Oc2ncccc2I)ccc1-c1c(C)n[nH]c(=O)c1C