Reaction Details
TargetPeroxisome proliferator-activated receptor gamma
LigandBDBM161148
Substrate/Competitorn/a
Meas. Tech.Lanthascreen Competitive Binding Assay
IC50 0.6±n/a nM
Citation Kamenecka, TMGriffin, PRKoenig, MAsteian, ABlayo, AHe, YShin, Y N-benzylindole modulators of PPARG US Patent US9051265 Publication Date 6/9/2015
 
Peroxisome proliferator-activated receptor gamma
Name:Peroxisome proliferator-activated receptor gamma
Type:Nuclear Receptor
Mol. Mass.:57613.46
Organism:Homo sapiens (Human)
Description:P37231
Residue:505
BDBM161148
NameBDBM161148
Synonyms:US9051265, 56
TypeSmall organic molecule
Emp. Form.C32H33ClN2O4
Mol. Mass.545.068
SMILESC[C@H](Oc1cc(Cn2c(C)c(C)c3cc(ccc23)C(=O)N[C@@H](C)c2cccc(c2)C2CC2)ccc1Cl)C(O)=O