Reaction Details
TargetPeroxisome proliferator-activated receptor gamma
LigandBDBM161155
Substrate/Competitorn/a
Meas. Tech.Lanthascreen Competitive Binding Assay
IC50 0.3±n/a nM
Citation Kamenecka, TMGriffin, PRKoenig, MAsteian, ABlayo, AHe, YShin, Y N-benzylindole modulators of PPARG US Patent US9051265 Publication Date 6/9/2015
 
Peroxisome proliferator-activated receptor gamma
Name:Peroxisome proliferator-activated receptor gamma
Type:Nuclear Receptor
Mol. Mass.:57613.46
Organism:Homo sapiens (Human)
Description:P37231
Residue:505
BDBM161155
NameBDBM161155
Synonyms:US9051265, 63
TypeSmall organic molecule
Emp. Form.C29H28BrClN2O4
Mol. Mass.583.901
SMILESC[C@H](Oc1ccc(Cl)c(Cn2c(C)c(C)c3cc(ccc23)C(=O)N[C@@H](C)c2ccc(Br)cc2)c1)C(O)=O