Reaction Details
TargetProto-oncogene tyrosine-protein kinase Src
LigandBDBM161376
Substrate/Competitorn/a
Meas. Tech.Enzyme Inhibition Assay
Kd 10±n/a nM
Citation Ito, KCharron, CEKing-Underwood, JOnions, STLongshaw, AIBroeckx, RFilliers, WCopmans, A 1-pyrazolyl-3-(4-((2-anilinopyrimidin-4-yl)oxy)napththalen-1-yl) ureas as p38 MAP kinase inhibitors US Patent US9108950 Publication Date 8/18/2015
 
Proto-oncogene tyrosine-protein kinase Src
Name:Proto-oncogene tyrosine-protein kinase Src
Type:Protein
Mol. Mass.:59838.60
Organism:Homo sapiens (Human)
Description:P12931
Residue:536
BDBM161376
NameBDBM161376
Synonyms:US10238658, Example 1 US9108950, 1 US9993478, Example 1
TypeSmall organic molecule
Emp. Form.C35H33N7O2
Mol. Mass.583.6822
SMILESCc1ccc(cc1)-n1nc(cc1NC(=O)Nc1ccc(Oc2ccnc(Nc3ccccc3)n2)c2ccccc12)C(C)(C)C