Reaction Details
TargetApoptosis regulator Bcl-2
LigandBDBM161624
Substrate/Competitorn/a
Meas. Tech.Fluorescence Polarisation Assay
pH7.4±n/a
IC50 3.5±n/a nM
Commentsextracted
Citation Le Tiran, ALe Diguarher, TStarck, JHenlin, JGuillouzic, ADe Nanteuil, GGeneste, OFejes, ITatai, JNyerges, MDavidson, JEMurray, JBChen, IDurand, D Pyrrole compounds, a process for their preparation and pharmaceutical compositions containing them US Patent US9108983 Publication Date 8/18/2015
 
Apoptosis regulator Bcl-2
Name:Apoptosis regulator Bcl-2
Type:Homodimer or heterodimer
Mol. Mass.:26269.11
Organism:Homo sapiens (Human)
Description:P10415
Residue:239
BDBM161624
NameBDBM161624
Synonyms:US9108983, Example 441
TypeSmall organic molecule
Emp. Form.C41H41ClN6O3
Mol. Mass.701.256
SMILESCc1c(cc(C#N)n1C)N(C(=O)c1cc(-c2cc(Cl)ccc2C(=O)N2Cc3ccccc3C[C@H]2CN2CCOCC2)n(C)c1C)c1ccccc1