Reaction Details
TargetHistone deacetylase 6
LigandBDBM162738
Substrate/Competitorn/a
Meas. Tech.Inhibition Assay
pH8±n/a
Temperature298.15±n/a K
IC50>10000±n/a nM
Commentsextracted
Citation Hebach, CJoly, EKallen, JTernois, JGTintelnot-Blomley, M Trifluoromethyl-oxadiazole derivatives and their use in the treatment of disease US Patent US9056843 Publication Date 6/16/2015
 
Histone deacetylase 6
Name:Histone deacetylase 6
Type:Chromatin regulator; hydrolase; repressor
Mol. Mass.:131381.51
Organism:Homo sapiens (Human)
Description:Q9UBN7
Residue:1215
BDBM162738
NameBDBM162738
Synonyms:US9056843, 29
TypeSmall organic molecule
Emp. Form.C15H14F3N3O2
Mol. Mass.325.2858
SMILESFC(F)(F)c1nc(no1)-c1ccc(cc1)C(=O)NC1CCCC1