Reaction Details
TargetATP-sensitive inward rectifier potassium channel 1
LigandBDBM50442595
Substrate/Competitorn/a
Meas. Tech.Electrophysiology Assay
pH7.4±n/a
IC50 61±n/a nM
Commentsextracted
Citation Pasternak, AdeJesus, RKZhu, YYang, LWalsh, STang, HKim, DPio, BShahripour, ABelyk, K Inhibitors of the renal outer medullary potassium channel US Patent US9056859 Publication Date 6/16/2015
 
ATP-sensitive inward rectifier potassium channel 1
Name:ATP-sensitive inward rectifier potassium channel 1
Type:Enzyme
Mol. Mass.:44976.27
Organism:Rattus norvegicus (Rat)
Description:P35560
Residue:391
BDBM50442595
NameBDBM50442595
Synonyms:CHEMBL2441408 | US9056859, 12
TypeSmall organic molecule
Emp. Form.C24H26N6O3
Mol. Mass.446.5016
SMILESO=C(Cc1ccc(cc1)-n1cnnn1)N1CCN(CCc2ccc3C(=O)OCCc3c2)CC1