Reaction Details
TargetN-glycosylase/DNA lyase
LigandBDBM163683
Substrate/Competitorn/a
Meas. Tech.Gel-based Cleavage Assay
IC50 3.4e+2± 4e+1 nM
Citation Donley, NJaruga, PCoskun, EDizdaroglu, MMcCullough, AKLloyd, RS Small Molecule Inhibitors of 8-Oxoguanine DNA Glycosylase-1 (OGG1). ACS Chem Biol10:2334-43 (2015) 
 
N-glycosylase/DNA lyase
Name:N-glycosylase/DNA lyase
Type:Protein
Mol. Mass.:38794.33
Organism:Homo sapiens (Human)
Description:O15527
Residue:345
BDBM163683
NameBDBM163683
Synonyms:N'‐Cyclohexylidene‐3‐hydroxynaphthalene‐2‐carbohydrazide (0158)
TypeSmall organic molecule
Emp. Form.C17H18N2O2
Mol. Mass.282.337
SMILES[#8]-c1cc2ccccc2cc1-[#6](=O)-[#7]\[#7]=[#6]-1/[#6]-[#6]-[#6]-[#6]-[#6]-1