Reaction Details
TargetHepatocyte growth factor receptor
LigandBDBM164417
Substrate/Competitorn/a
Meas. Tech.In Vitro Assay
pH8±n/a
Temperature300.15±n/a K
Ki 23.8±n/a nM
Commentsextracted
Citation Albrecht, BKBauer, DBellon, SBode, CMBooker, SBoezio, AChoquette, DD'Amico, DHarmange, JHirai, SHungate, RWKim, TLewis, RTLiu, LLohman, JWNorman, MHPotashman, MSiegmund, ACSpringer, SKStec, MXi, NYang, K Fused heterocyclic derivatives and methods of use US Patent US9066954 Publication Date 6/30/2015
 
Hepatocyte growth factor receptor
Name:Hepatocyte growth factor receptor
Type:Protein
Mol. Mass.:155559.73
Organism:Homo sapiens (Human)
Description:P08581
Residue:1390
BDBM164417
NameBDBM164417
Synonyms:US9066954, 50
TypeSmall organic molecule
Emp. Form.C21H19N5O3
Mol. Mass.389.4073
SMILESCOc1ccc2c(OCc3nnc4ccc(nn34)C#CC(C)(C)O)ccnc2c1