Reaction Details
TargetHepatocyte growth factor receptor
LigandBDBM164420
Substrate/Competitorn/a
Meas. Tech.In Vitro Assay
pH8±n/a
Temperature300.15±n/a K
Ki 0.9±n/a nM
Commentsextracted
Citation Albrecht, BKBauer, DBellon, SBode, CMBooker, SBoezio, AChoquette, DD'Amico, DHarmange, JHirai, SHungate, RWKim, TLewis, RTLiu, LLohman, JWNorman, MHPotashman, MSiegmund, ACSpringer, SKStec, MXi, NYang, K Fused heterocyclic derivatives and methods of use US Patent US9066954 Publication Date 6/30/2015
 
Hepatocyte growth factor receptor
Name:Hepatocyte growth factor receptor
Type:Protein
Mol. Mass.:155559.73
Organism:Homo sapiens (Human)
Description:P08581
Residue:1390
BDBM164420
NameBDBM164420
Synonyms:US9066954, 55
TypeSmall organic molecule
Emp. Form.C20H16N8O
Mol. Mass.384.394
SMILESCOc1cnc2c(NCc3nnc4ncc(nn34)-c3ccccc3)ccnc2c1