Reaction Details
TargetHepatocyte growth factor receptor
LigandBDBM164442
Substrate/Competitorn/a
Meas. Tech.In Vitro Assay
pH8±n/a
Temperature300.15±n/a K
Ki 5.4±n/a nM
Commentsextracted
Citation Albrecht, BKBauer, DBellon, SBode, CMBooker, SBoezio, AChoquette, DD'Amico, DHarmange, JHirai, SHungate, RWKim, TLewis, RTLiu, LLohman, JWNorman, MHPotashman, MSiegmund, ACSpringer, SKStec, MXi, NYang, K Fused heterocyclic derivatives and methods of use US Patent US9066954 Publication Date 6/30/2015
 
Hepatocyte growth factor receptor
Name:Hepatocyte growth factor receptor
Type:Protein
Mol. Mass.:155559.73
Organism:Homo sapiens (Human)
Description:P08581
Residue:1390
BDBM164442
NameBDBM164442
Synonyms:US9066954, 121
TypeSmall organic molecule
Emp. Form.C21H13F2N5
Mol. Mass.373.3582
SMILESFC(F)(c1nnc2ccc(nn12)-c1ccccc1)c1ccc2ncccc2c1