Reaction Details
TargetHepatocyte growth factor receptor
LigandBDBM164455
Substrate/Competitorn/a
Meas. Tech.In Vitro Assay
pH8±n/a
Temperature300.15±n/a K
Ki 4.9±n/a nM
Commentsextracted
Citation Albrecht, BKBauer, DBellon, SBode, CMBooker, SBoezio, AChoquette, DD'Amico, DHarmange, JHirai, SHungate, RWKim, TLewis, RTLiu, LLohman, JWNorman, MHPotashman, MSiegmund, ACSpringer, SKStec, MXi, NYang, K Fused heterocyclic derivatives and methods of use US Patent US9066954 Publication Date 6/30/2015
 
Hepatocyte growth factor receptor
Name:Hepatocyte growth factor receptor
Type:Protein
Mol. Mass.:155559.73
Organism:Homo sapiens (Human)
Description:P08581
Residue:1390
BDBM164455
NameBDBM164455
Synonyms:US9066954, 187
TypeSmall organic molecule
Emp. Form.C21H18N8O2
Mol. Mass.414.42
SMILESCOc1cnc2c(NCc3nnc4ccc(nn34)-c3ccc(=O)n(C)c3)ccnc2c1