Reaction Details
TargetHepatocyte growth factor receptor
LigandBDBM164469
Substrate/Competitorn/a
Meas. Tech.In Vitro Assay
pH8±n/a
Temperature300.15±n/a K
Ki 2.8±n/a nM
Commentsextracted
Citation Albrecht, BKBauer, DBellon, SBode, CMBooker, SBoezio, AChoquette, DD'Amico, DHarmange, JHirai, SHungate, RWKim, TLewis, RTLiu, LLohman, JWNorman, MHPotashman, MSiegmund, ACSpringer, SKStec, MXi, NYang, K Fused heterocyclic derivatives and methods of use US Patent US9066954 Publication Date 6/30/2015
 
Hepatocyte growth factor receptor
Name:Hepatocyte growth factor receptor
Type:Protein
Mol. Mass.:155559.73
Organism:Homo sapiens (Human)
Description:P08581
Residue:1390
BDBM164469
NameBDBM164469
Synonyms:US9066954, 294
TypeSmall organic molecule
Emp. Form.C25H19N5O3
Mol. Mass.437.4501
SMILESCOc1ccc2c(OCc3nnc4ccc(cn34)-c3ccc4NC(=O)Cc4c3)ccnc2c1