Reaction Details
TargetCasein kinase II subunit alpha
LigandBDBM165362
Substrate/Competitorn/a
Meas. Tech.In Vitro Cell-Free Assay
pH7.2±n/a
IC50 9±n/a nM
Commentsextracted
Citation Chua, PCPierre, FWhitten, JP Fused tricyclic compounds as serine-threonine protein kinase and PARP modulators US Patent US9062043 Publication Date 6/23/2015
 
Casein kinase II subunit alpha
Name:Casein kinase II subunit alpha
Type:Enzyme
Mol. Mass.:45151.12
Organism:Homo sapiens (Human)
Description:P68400
Residue:391
BDBM165362
NameBDBM165362
Synonyms:US8168651, Compound TABLE 16.29 | US9062043, Table 13, Compound 29
TypeSmall organic molecule
Emp. Form.C20H15N3O2
Mol. Mass.329.352
SMILESOC(=O)c1ccc2c(c1)nc(NCc1ccccc1)c1ccncc21