Reaction Details
TargetCasein kinase II subunit alpha
LigandBDBM165363
Substrate/Competitorn/a
Meas. Tech.In Vitro Cell-Free Assay
pH7.2±n/a
IC50 5±n/a nM
Commentsextracted
Citation Chua, PCPierre, FWhitten, JP Fused tricyclic compounds as serine-threonine protein kinase and PARP modulators US Patent US9062043 Publication Date 6/23/2015
 
Casein kinase II subunit alpha
Name:Casein kinase II subunit alpha
Type:Enzyme
Mol. Mass.:45151.12
Organism:Homo sapiens (Human)
Description:P68400
Residue:391
BDBM165363
NameBDBM165363
Synonyms:US8168651, Compound TABLE 16.30 US9062043, Table 20b, Compound 21
TypeSmall organic molecule
Emp. Form.C21H16ClN3O2
Mol. Mass.377.824
SMILESOC(=O)c1ccc2c(c1)nc(NCCc1cccc(Cl)c1)c1ccncc21