Reaction Details
TargetCasein kinase II subunit alpha
LigandBDBM165390
Substrate/Competitorn/a
Meas. Tech.In Vitro Cell-Free Assay
pH7.2±n/a
IC50 11±n/a nM
Commentsextracted
Citation Chua, PCPierre, FWhitten, JP Fused tricyclic compounds as serine-threonine protein kinase and PARP modulators US Patent US9062043 Publication Date 6/23/2015
 
Casein kinase II subunit alpha
Name:Casein kinase II subunit alpha
Type:Enzyme
Mol. Mass.:45151.12
Organism:Homo sapiens (Human)
Description:P68400
Residue:391
BDBM165390
NameBDBM165390
Synonyms:US8168651, Compound TABLE 16.58 US9062043, Table 20b, Compound 27
TypeSmall organic molecule
Emp. Form.C19H11F3N4O2
Mol. Mass.384.3114
SMILESOC(=O)c1ccc2c(c1)nc(Nc1cccc(c1)C(F)(F)F)c1ncncc21