Reaction Details
TargetCasein kinase II subunit alpha
LigandBDBM165421
Substrate/Competitorn/a
Meas. Tech.In Vitro Cell-Free Assay
pH7.2±n/a
IC50 11±n/a nM
Commentsextracted
Citation Chua, PCPierre, FWhitten, JP Fused tricyclic compounds as serine-threonine protein kinase and PARP modulators US Patent US9062043 Publication Date 6/23/2015
 
Casein kinase II subunit alpha
Name:Casein kinase II subunit alpha
Type:Enzyme
Mol. Mass.:45151.12
Organism:Homo sapiens (Human)
Description:P68400
Residue:391
BDBM165421
NameBDBM165421
Synonyms:US8168651, Compound TABLE 16.89 | US9062043, Table 13, Compound 89
TypeSmall organic molecule
Emp. Form.C20H12F3N3O2
Mol. Mass.383.3234
SMILESOC(=O)c1ccc2c(c1)nc(Nc1cccc(c1)C(F)(F)F)c1ccncc21