Reaction Details
TargetCasein kinase II subunit alpha
LigandBDBM165405
Substrate/Competitorn/a
Meas. Tech.Modulation of Endogenous Assay
pH7.4±n/a
IC50 11±n/a nM
Commentsextracted
Citation Chua, PCPierre, FWhitten, JP Fused tricyclic compounds as serine-threonine protein kinase and PARP modulators US Patent US9062043 Publication Date 6/23/2015
 
Casein kinase II subunit alpha
Name:Casein kinase II subunit alpha
Type:Enzyme
Mol. Mass.:45151.12
Organism:Homo sapiens (Human)
Description:P68400
Residue:391
BDBM165405
NameBDBM165405
Synonyms:US8168651, Compound TABLE 16.73 US9062043, Table 20b, Compound 35
TypeSmall organic molecule
Emp. Form.C25H21N5O3
Mol. Mass.439.4659
SMILESOC(=O)c1ccc2c(c1)nc(Nc1cccc(c1)C#C)c1nc(NCC3CCCO3)ncc21