Reaction Details
TargetMaternal embryonic leucine zipper kinase
LigandBDBM60438
Substrate/Competitorn/a
Meas. Tech.Kinase Assay
pH7.4±n/a
Temperature298.15±n/a K
IC50 0.4±n/a nM
Commentsextracted
Citation Matsuo, YHisada, SNakamura, YAhmed, FWalker, JRHuntley, R 1,5-naphthyridine derivatives and MELK inhibitors containing the same US Patent US9067937 Publication Date 6/30/2015
 
Maternal embryonic leucine zipper kinase
Name:Maternal embryonic leucine zipper kinase
Type:Enzyme
Mol. Mass.:74665.45
Organism:Homo sapiens (Human)
Description:Q14680
Residue:651
BDBM60438
NameBDBM60438
Synonyms:US9067937, 28
Typen/a
Emp. Form.C25H28Cl2N4O2
Mol. Mass.487.421
SMILESCN(C)C[C@H]1CC[C@@H](CC1)Nc1c(cnc2ccc(nc12)-c1cc(Cl)c(O)c(Cl)c1)C(C)=O