Reaction Details
TargetMaternal embryonic leucine zipper kinase
LigandBDBM166084
Substrate/Competitorn/a
Meas. Tech.Kinase Assay
pH7.4±n/a
Temperature298.15±n/a K
IC50 0.7±n/a nM
Commentsextracted
Citation Matsuo, YHisada, SNakamura, YAhmed, FWalker, JRHuntley, R 1,5-naphthyridine derivatives and MELK inhibitors containing the same US Patent US9067937 Publication Date 6/30/2015
 
Maternal embryonic leucine zipper kinase
Name:Maternal embryonic leucine zipper kinase
Type:Enzyme
Mol. Mass.:74665.45
Organism:Homo sapiens (Human)
Description:Q14680
Residue:651
BDBM166084
NameBDBM166084
Synonyms:US9067937, 27
TypeSmall organic molecule
Emp. Form.C23H24Cl2N4O2
Mol. Mass.459.368
SMILESCN1CCC(CNc2c(cnc3ccc(nc23)-c2cc(Cl)c(O)c(Cl)c2)C(C)=O)CC1