Reaction Details
TargetMaternal embryonic leucine zipper kinase
LigandBDBM166119
Substrate/Competitorn/a
Meas. Tech.Kinase Assay
pH7.4±n/a
Temperature298.15±n/a K
IC50 0.8±n/a nM
Commentsextracted
Citation Matsuo, YHisada, SNakamura, YAhmed, FWalker, JRHuntley, R 1,5-naphthyridine derivatives and MELK inhibitors containing the same US Patent US9067937 Publication Date 6/30/2015
 
Maternal embryonic leucine zipper kinase
Name:Maternal embryonic leucine zipper kinase
Type:Enzyme
Mol. Mass.:74665.45
Organism:Homo sapiens (Human)
Description:Q14680
Residue:651
BDBM166119
NameBDBM166119
Synonyms:US9067937, 63
TypeSmall organic molecule
Emp. Form.C28H33Cl2N5O2
Mol. Mass.542.5
SMILESCN1CCN(C[C@H]2CC[C@@H](CC2)Nc2c(cnc3ccc(nc23)-c2cc(Cl)c(O)c(Cl)c2)C(C)=O)CC1