Reaction Details
TargetHigh affinity cAMP-specific and IBMX-insensitive 3',5'-cyclic phosphodiesterase 8A
LigandBDBM123687
Substrate/Competitorn/a
Meas. Tech.Inhibition Assay
pH7.5±n/a
IC50>4000±n/a nM
Commentsextracted
Citation Böss, FErb, CHendrix, MVan Kampen, MWunder, F Selective phosphodiesterase 9A inhibitors as medicaments for improving cognitive processes US Patent US9067945 Publication Date 6/30/2015
 
High affinity cAMP-specific and IBMX-insensitive 3',5'-cyclic phosphodiesterase 8A
Name:High affinity cAMP-specific and IBMX-insensitive 3',5'-cyclic phosphodiesterase 8A
Type:Enzyme Catalytic Domain
Mol. Mass.:93295.89
Organism:Homo sapiens (Human)
Description:Recombinant catalytic domain (M1-E829) of human PDE8A.
Residue:829
BDBM123687
NameBDBM123687
Synonyms:US8741907, 3 | US9067945, 2
TypeSmall organic molecule
Emp. Form.C17H26N4O
Mol. Mass.302.4145
SMILESCCC(CC)n1ncc2c1nc(CC1CCCCC1)[nH]c2=O