Reaction Details
TargetArachidonate 5-lipoxygenase-activating protein
LigandBDBM167144
Substrate/Competitorn/a
Meas. Tech.Homogeneous Time Resolved Fluorescence Assay
Ki 1.4±n/a nM
Citation Eccles, WFitzgerald, AEHack, MDHawryluk, NAJones, WMKeith, JMKrawczuk, PLebsack, ADLiu, JMani, NSMcClure, KJMeduna, SPRosen, MD Flap modulators US Patent US9073876 Publication Date 7/7/2015
 
Arachidonate 5-lipoxygenase-activating protein
Name:Arachidonate 5-lipoxygenase-activating protein
Type:Enzyme
Mol. Mass.:18159.90
Organism:Homo sapiens (Human)
Description:P20292
Residue:161
BDBM167144
NameBDBM167144
Synonyms:US9073876, 226 | US9732093, Compound 226
TypeSmall organic molecule
Emp. Form.C21H20FN5O2
Mol. Mass.393.4142
SMILESNc1ccnc(Oc2c(F)c(ccc2C2CCC2)-c2cnc3NCCOc3c2)n1