Reaction Details
Target11-beta-hydroxysteroid dehydrogenase 1
LigandBDBM167438
Substrate/Competitorn/a
Meas. Tech.Homogenous Time-Resolved Fluorescence (HTRF) Assay
IC50 0.2±n/a nM
Citation Kim, KYAhn, JHKang, SKRhee, SDBae, MAAhn, SHKim, HYJung, WHKang, NS Sulfamide derivative having an adamantyl group and its pharmaceutically acceptable salt US Patent US9073906 Publication Date 7/7/2015
 
11-beta-hydroxysteroid dehydrogenase 1
Name:11-beta-hydroxysteroid dehydrogenase 1
Type:Enzyme
Mol. Mass.:32409.16
Organism:Homo sapiens (Human)
Description:P28845
Residue:292
BDBM167438
NameBDBM167438
Synonyms:US9073906, 88
TypeSmall organic molecule
Emp. Form.C22H27Cl3N4O4S
Mol. Mass.549.898
SMILESNC(=O)C12CC3CC(C1)C(NC(=O)CN1CCCN(c4c(Cl)cc(Cl)cc4Cl)S1(=O)=O)C(C3)C2