Reaction Details
Target11-beta-hydroxysteroid dehydrogenase 1
LigandBDBM167443
Substrate/Competitorn/a
Meas. Tech.Homogenous Time-Resolved Fluorescence (HTRF) Assay
IC50 0.1±n/a nM
Citation Kim, KYAhn, JHKang, SKRhee, SDBae, MAAhn, SHKim, HYJung, WHKang, NS Sulfamide derivative having an adamantyl group and its pharmaceutically acceptable salt US Patent US9073906 Publication Date 7/7/2015
 
11-beta-hydroxysteroid dehydrogenase 1
Name:11-beta-hydroxysteroid dehydrogenase 1
Type:Enzyme
Mol. Mass.:32409.16
Organism:Homo sapiens (Human)
Description:P28845
Residue:292
BDBM167443
NameBDBM167443
Synonyms:US9073906, 128
TypeSmall organic molecule
Emp. Form.C23H29Cl3N4O4S
Mol. Mass.563.925
SMILESCC1CCN(c2c(Cl)cc(Cl)cc2Cl)S(=O)(=O)N1CC(=O)NC1C2CC3CC1CC(C3)(C2)C(N)=O