Reaction Details
TargetAcetylcholinesterase
LigandBDBM10620
Substrate/Competitorn/a
Meas. Tech.Modified Ellman Assay
IC50 5.6e+3± 2e+1 nM
Citation Sang, ZPQiang, XMLi, YWu, BZhang, HZhao, MGDeng, Y Design, synthesis, and biological evaluation of scutellarein carbamate derivatives as potential multifunctional agents for the treatment of Alzheimer's disease. Chem Biol Drug Des86:1168-77 (2015) 
 
Acetylcholinesterase
Name:Acetylcholinesterase
Type:Enzyme
Mol. Mass.:68193.62
Organism:Rattus norvegicus (rat)
Description:P37136
Residue:614
BDBM10620
NameBDBM10620
Synonyms:(S)-3-(1-(dimethylamino)ethyl)phenyl ethyl(methyl)carbamate 3-(1-(dimethylamino)ethyl)phenyl ethyl(methyl)carbamate CHEMBL636 Ethyl-methyl-carbamic acid 3-((R)-1-dimethylamino-ethyl)-phenyl ester Ethyl-methyl-carbamic acid 3-(1-dimethylamino-ethyl)-phenyl ester Rivastigmine SDZ-212-713 | SDZ-ENA-713
TypeSmall organic molecule
Emp. Form.C14H22N2O2
Mol. Mass.250.3367
SMILES[H][C@@](C)(N(C)C)c1cccc(OC(=O)N(C)CC)c1