Reaction Details
TargetAcetylcholinesterase
LigandBDBM167904
Substrate/Competitorn/a
Meas. Tech.Modified Ellman Assay
IC50 1.2e+3± 3e+1 nM
Citation Sang, ZPQiang, XMLi, YWu, BZhang, HZhao, MGDeng, Y Design, synthesis, and biological evaluation of scutellarein carbamate derivatives as potential multifunctional agents for the treatment of Alzheimer's disease. Chem Biol Drug Des86:1168-77 (2015) 
 
Acetylcholinesterase
Name:Acetylcholinesterase
Type:Enzyme
Mol. Mass.:68193.62
Organism:Rattus norvegicus (rat)
Description:P37136
Residue:614
BDBM167904
NameBDBM167904
Synonyms:N,N-diethylcarbamic acid-4-(5,6,7-trihydroxy-4-oxo-4H-1-benzopyran-2-yl)phenyl ester (7b)
TypeSmall organic molecule
Emp. Form.C20H19NO7
Mol. Mass.385.3674
SMILESCCN(CC)C(=O)Oc1ccc(cc1)-c1cc(=O)c2c(O)c(O)c(O)cc2o1