Reaction Details
TargetAcetylcholinesterase
LigandBDBM167906
Substrate/Competitorn/a
Meas. Tech.Modified Ellman Assay
IC50 2.7e+3± 2e+1 nM
Citation Sang, ZPQiang, XMLi, YWu, BZhang, HZhao, MGDeng, Y Design, synthesis, and biological evaluation of scutellarein carbamate derivatives as potential multifunctional agents for the treatment of Alzheimer's disease. Chem Biol Drug Des86:1168-77 (2015) 
 
Acetylcholinesterase
Name:Acetylcholinesterase
Type:Enzyme
Mol. Mass.:68193.62
Organism:Rattus norvegicus (rat)
Description:P37136
Residue:614
BDBM167906
NameBDBM167906
Synonyms:N-ethyl-N-methylcarbamic acid-4-(5,6,7-trihydroxy-4-oxo-4H-1-benzopyran-2-yl)phenyl ester (7d)
TypeSmall organic molecule
Emp. Form.C19H17NO7
Mol. Mass.371.3408
SMILESCCN(C)C(=O)Oc1ccc(cc1)-c1cc(=O)c2c(O)c(O)c(O)cc2o1