Reaction Details
TargetAcetylcholinesterase
LigandBDBM167907
Substrate/Competitorn/a
Meas. Tech.Modified Ellman Assay
IC50 4.07e+4± 1.8e+2 nM
Citation Sang, ZPQiang, XMLi, YWu, BZhang, HZhao, MGDeng, Y Design, synthesis, and biological evaluation of scutellarein carbamate derivatives as potential multifunctional agents for the treatment of Alzheimer's disease. Chem Biol Drug Des86:1168-77 (2015) 
 
Acetylcholinesterase
Name:Acetylcholinesterase
Type:Enzyme
Mol. Mass.:68193.62
Organism:Rattus norvegicus (rat)
Description:P37136
Residue:614
BDBM167907
NameBDBM167907
Synonyms:1-Pyrrolidinecarboxylic acid-4-(5,6,7-trihydroxy-4-oxo-4H-1-benzopyran-2-yl)phenyl ester (7e)
TypeSmall organic molecule
Emp. Form.C20H17NO7
Mol. Mass.383.3515
SMILESOc1cc2oc(cc(=O)c2c(O)c1O)-c1ccc(OC(=O)N2CCCC2)cc1