Reaction Details
TargetAcetylcholinesterase
LigandBDBM167908
Substrate/Competitorn/a
Meas. Tech.Modified Ellman Assay
IC50 2.85e+4± 9e+1 nM
Citation Sang, ZPQiang, XMLi, YWu, BZhang, HZhao, MGDeng, Y Design, synthesis, and biological evaluation of scutellarein carbamate derivatives as potential multifunctional agents for the treatment of Alzheimer's disease. Chem Biol Drug Des86:1168-77 (2015) 
 
Acetylcholinesterase
Name:Acetylcholinesterase
Type:Enzyme
Mol. Mass.:68193.62
Organism:Rattus norvegicus (rat)
Description:P37136
Residue:614
BDBM167908
NameBDBM167908
Synonyms:4-Morpholinecarboxylic acid-4-(5,6,7-trihydroxy-4-oxo-4H-1-benzopyran-2-yl)phenyl ester (7f)
TypeSmall organic molecule
Emp. Form.C20H17NO8
Mol. Mass.399.3509
SMILESOc1cc2oc(cc(=O)c2c(O)c1O)-c1ccc(OC(=O)N2CCOCC2)cc1